BDBM462740 US10780090, Compound I-74::[(1R,2S,4R)-2-hydroxy-4-{[5-({4-[(4-methyl-1H-pyrazol-1-yl)methyl]-2- thienyl}carbonyl)pyrimidin-4-yl]amino}cyclopentyl]methyl sulfamate
SMILES Cc1cnn(Cc2csc(c2)C(=O)c2cncnc2N[C@H]2C[C@H](O)[C@@H](COS(N)(=O)=O)C2)c1
InChI Key InChIKey=IXCAFZCCLIBVPC-INMHGKMJSA-N
Data  1 IC50
  Tab Delimited (TSV)   2D SDfile   Computed 3D by Vconf -m prep SDfile
Find this compound or compounds like it in BindingDB:
Activity Spreadsheet -- Enzyme Inhibition Constant Data from BindingDB
Found 1 hit for monomerid = 462740
TargetSUMO-activating enzyme subunit 1(Homo sapiens (Human))
Millennium Pharmaceuticals
US Patent
LigandPNGBDBM462740(US10780090, Compound I-74 | [(1R,2S,4R)-2-hydroxy-...)
Affinity DataIC50: <10nM. Assay description: The SAE enzymatic reaction totals 50 μl and contains 50 mM HEPES Hemisodium (pH 7.5), 0.05% BSA, 5 mM MgCl2, 0.5 μM ATP, 250 μM GSH, 0...
Ligand InfoPC cidPC sid
In DepthDetails US Patent