BDBM462767 US10780090, Compound I-99::{(1R,2R,3R,4R)-3-fluoro-2-hydroxy-4-[(5-{[4-(3-iodobenzyl)-2- thienyl]carbonyl}pyrimidin-4-yl)amino]cyclopentyl}methyl sulfamate
SMILES NS(=O)(=O)OC[C@H]1C[C@@H](Nc2ncncc2C(=O)c2cc(Cc3cccc(I)c3)cs2)[C@@H](F)[C@@H]1O
InChI Key InChIKey=DXEVQOXEXCQXPP-SJFSSXKUSA-N
Data  1 IC50
  Tab Delimited (TSV)   2D SDfile   Computed 3D by Vconf -m prep SDfile
Find this compound or compounds like it in BindingDB:
Activity Spreadsheet -- Enzyme Inhibition Constant Data from BindingDB
Found 1 hit for monomerid = 462767
TargetSUMO-activating enzyme subunit 1(Homo sapiens (Human))
Millennium Pharmaceuticals
US Patent
LigandPNGBDBM462767(US10780090, Compound I-99 | {(1R,2R,3R,4R)-3-fluor...)
Affinity DataIC50: <10nM. Assay description: The SAE enzymatic reaction totals 50 μl and contains 50 mM HEPES Hemisodium (pH 7.5), 0.05% BSA, 5 mM MgCl2, 0.5 μM ATP, 250 μM GSH, 0...
Ligand InfoPC cidPC sid
In DepthDetails US Patent