BDBM46278 4-chloranyl-N-(2,3-dihydro-1H-inden-5-yl)-3-sulfamoyl-benzamide::4-chloro-N-(2,3-dihydro-1H-inden-5-yl)-3-sulfamoylbenzamide::4-chloro-N-indan-5-yl-3-sulfamoyl-benzamide::MLS-0335846.0001::cid_4880260
SMILES NS(=O)(=O)c1cc(ccc1Cl)C(=O)Nc1ccc2CCCc2c1
InChI Key InChIKey=ODJLRXBNFLFJCD-UHFFFAOYSA-N
Data  2 IC50
  Tab Delimited (TSV)   2D SDfile   Computed 3D by Vconf -m prep SDfile
Find this compound or compounds like it in BindingDB:
Activity Spreadsheet -- Enzyme Inhibition Constant Data from BindingDB
Found 2 hits for monomerid = 46278
TargetTyrosine-protein phosphatase non-receptor type 7(Homo sapiens (Human))
Burnham Center For Chemical Genomics
Curated by PubChem BioAssay
LigandPNGBDBM46278(4-chloranyl-N-(2,3-dihydro-1H-inden-5-yl)-3-sulfam...)
Affinity DataIC50:  1.00E+5nM. Assay description: Data Source: Sanford-Burnham Center for Chemical Genomics (SBCCG) Source Affiliation: Sanford-Burnham Medical Research Institute (SBMRI, San Diego, C...
In DepthDetails PCBioAssay
TargetTyrosine-protein phosphatase non-receptor type 7(Homo sapiens (Human))
Burnham Center For Chemical Genomics
Curated by PubChem BioAssay
LigandPNGBDBM46278(4-chloranyl-N-(2,3-dihydro-1H-inden-5-yl)-3-sulfam...)
Affinity DataIC50: >1.00E+5nM. Assay description: Data Source: Sanford-Burnham Center for Chemical Genomics (SBCCG) Source Affiliation: Sanford-Burnham Medical Research Institute (SBMRI, San Diego, C...
In DepthDetails PCBioAssay