BDBM46309 (1,1-diketo-1,2-benzothiazol-3-yl)-methyl-[(5-methyl-2-furyl)methyleneamino]amine::5-methyl-2-furaldehyde (1,1-dioxido-1,2-benzisothiazol-3-yl)(methyl)hydrazone::MLS000686257::N-methyl-N-[(5-methyl-2-furanyl)methylideneamino]-1,1-dioxo-1,2-benzothiazol-3-amine::N-methyl-N-[(5-methylfuran-2-yl)methylideneamino]-1,1-bis(oxidanylidene)-1,2-benzothiazol-3-amine::N-methyl-N-[(5-methylfuran-2-yl)methylideneamino]-1,1-dioxo-1,2-benzothiazol-3-amine::SMR000313100::cid_4614007
SMILES CN(N=Cc1ccc(C)o1)C1=NS(=O)(=O)c2ccccc12
InChI Key InChIKey=REZXESHDGCKUPH-UHFFFAOYSA-N
Data  3 EC50
  Tab Delimited (TSV)   2D SDfile   Computed 3D by Vconf -m prep SDfile
Find this compound or compounds like it in BindingDB:
Activity Spreadsheet -- Enzyme Inhibition Constant Data from BindingDB
Found 3 hits for monomerid = 46309
TargetBcl-2-like protein 10 [11-204](Homo sapiens (Human))
Nmmlsc
Curated by PubChem BioAssay
LigandPNGBDBM46309((1,1-diketo-1,2-benzothiazol-3-yl)-methyl-[(5-meth...)
Affinity DataEC50:  7.38E+3nM. Assay description: University of New Mexico Assay Overview: Assay Support: NIH 1X01 MH079850-01 HTS to identify small molecule regulators of Bcl-2 family protein int...
In DepthDetails PCBioAssay
TargetGlutathione S-transferase Mu 1(Homo sapiens (Human))
Nmmlsc
Curated by PubChem BioAssay
LigandPNGBDBM46309((1,1-diketo-1,2-benzothiazol-3-yl)-methyl-[(5-meth...)
Affinity DataEC50:  7.42E+3nM. Assay description: University of New Mexico Assay Overview: Assay Support: NIH I RO3 MH081231-01 HTS to identify specific small molecule inhibitors of Ras and Ras-re...
In DepthDetails PCBioAssay
TargetBcl-2-like protein 2(Homo sapiens (Human))
Nmmlsc
Curated by PubChem BioAssay
LigandPNGBDBM46309((1,1-diketo-1,2-benzothiazol-3-yl)-methyl-[(5-meth...)
Affinity DataEC50:  1.66E+4nM. Assay description: University of New Mexico Assay Overview: Assay Support: NIH 1X01 MH079850-01 HTS to identify small molecule regulators of Bcl-2 family protein int...
In DepthDetails PCBioAssay