BDBM46313 (E)-1-phenyl-3-(5-phenyl-2-furanyl)-2-propen-1-one::(E)-1-phenyl-3-(5-phenyl-2-furyl)prop-2-en-1-one::(E)-1-phenyl-3-(5-phenylfuran-2-yl)prop-2-en-1-one::1-Phenyl-3-(5-phenyl-furan-2-yl)-propenone::MLS000567589::SMR000175494::cid_5705712
SMILES O=C(\C=C\c1ccc(o1)-c1ccccc1)c1ccccc1
InChI Key InChIKey=ATYVZTGIQBANCN-ACCUITESSA-N
Data  2 EC50
  Tab Delimited (TSV)   2D SDfile   Computed 3D by Vconf -m prep SDfile
Find this compound or compounds like it in BindingDB:
Activity Spreadsheet -- Enzyme Inhibition Constant Data from BindingDB
Found 2 hits for monomerid = 46313
TargetProbable global transcription activator SNF2L2(Homo sapiens (Human))
The Scripps Research Institute Molecular Screening Center
Curated by PubChem BioAssay
LigandPNGBDBM46313((E)-1-phenyl-3-(5-phenyl-2-furanyl)-2-propen-1-one...)
Affinity DataEC50:  9.12E+4nM
In DepthDetails PCBioAssay
TargetBcl-2-like protein 2(Homo sapiens (Human))
Nmmlsc
Curated by PubChem BioAssay
LigandPNGBDBM46313((E)-1-phenyl-3-(5-phenyl-2-furanyl)-2-propen-1-one...)
Affinity DataEC50:  1.39E+4nM. Assay description: University of New Mexico Assay Overview: Assay Support: NIH 1X01 MH079850-01 HTS to identify small molecule regulators of Bcl-2 family protein int...
In DepthDetails PCBioAssay