BDBM46316 MLS000049286::N-[4-(4-pyrrolidin-1-ylsulfonylphenyl)-1,3-thiazol-2-yl]furan-2-carboxamide::N-[4-(4-pyrrolidinosulfonylphenyl)thiazol-2-yl]-2-furamide::N-[4-[4-(1-pyrrolidinylsulfonyl)phenyl]-2-thiazolyl]-2-furancarboxamide::N-{4-[4-(1-pyrrolidinylsulfonyl)phenyl]-1,3-thiazol-2-yl}-2-furamide::SMR000075098::cid_1236900
SMILES O=C(Nc1nc(cs1)-c1ccc(cc1)S(=O)(=O)N1CCCC1)c1ccco1
InChI Key InChIKey=JHERMBZHKYZGIF-UHFFFAOYSA-N
Data  1 EC50
  Tab Delimited (TSV)   2D SDfile   Computed 3D by Vconf -m prep SDfile
Find this compound or compounds like it in BindingDB:
Activity Spreadsheet -- Enzyme Inhibition Constant Data from BindingDB
Found 1 hit for monomerid = 46316
LigandPNGBDBM46316(MLS000049286 | N-[4-(4-pyrrolidin-1-ylsulfonylphen...)
Affinity DataEC50:  1.76E+3nM. Assay description: University of New Mexico Assay Overview: Assay Support: NIH I RO3 MH081231-01 HTS to identify specific small molecule inhibitors of Ras and Ras-rela...
In DepthDetails PCBioAssay