BDBM463188 4-Amino-2-(8-butyl- [1,2,4]triazolo[1,5-a]pyrazin-6- yl)-5-(4-chloro-3-fluoro-5- hydroxyphenyl)-5-methyl-5,7- dihydro-6H-pyrrolo[2,3- d]pyrimidin-6-one::US10780092, Example 42-B
SMILES CCCCc1nc(cn2ncnc12)-c1nc2NC(=O)C(C)(c2c(N)n1)c1cc(O)c(Cl)c(F)c1
InChI Key InChIKey=BCLQFUPUSOALKF-UHFFFAOYSA-N
Data  1 KI
  Tab Delimited (TSV)   2D SDfile   Computed 3D by Vconf -m prep SDfile
Find this compound or compounds like it in BindingDB:
Activity Spreadsheet -- Enzyme Inhibition Constant Data from BindingDB
Found 1 hit for monomerid = 463188
TargetGuanylate cyclase soluble subunit alpha-1(Homo sapiens (Human))
Merck Sharp & Dohme
US Patent
LigandPNGBDBM463188(4-Amino-2-(8-butyl- [1,2,4]triazolo[1,5-a]pyrazin-...)
Affinity DataKi:  0.496nM. Assay description: The binding potencies of sGC compounds to the human recombinant sGC enzyme were determined in a Size Exclusion Chromatography (SEC) competition bindi...
Ligand InfoPC cidPC sid
In DepthDetails US Patent