BDBM463243 4-Amino-2-(8- (cyclohexylmethyl)imidazo[1,2- a]pyrazin-6-yl)-5-(3-fluoro-5- hydroxy-4- (trifluoromethyl)phenyl)-5- methyl-5,7-dihydro-6H- pyrrolo[2,3-d]pyrimidin-6-one::US10780092, Example 97-B
SMILES CC1(C(=O)Nc2nc(nc(N)c12)-c1cn2ccnc2c(CC2CCCCC2)n1)c1cc(O)c(c(F)c1)C(F)(F)F
InChI Key InChIKey=ABFJCTMQUFLVQI-UHFFFAOYSA-N
Data  1 KI
  Tab Delimited (TSV)   2D SDfile   Computed 3D by Vconf -m prep SDfile
Find this compound or compounds like it in BindingDB:
Activity Spreadsheet -- Enzyme Inhibition Constant Data from BindingDB
Found 1 hit for monomerid = 463243
TargetGuanylate cyclase soluble subunit alpha-1(Homo sapiens (Human))
Merck Sharp & Dohme
US Patent
LigandPNGBDBM463243(4-Amino-2-(8- (cyclohexylmethyl)imidazo[1,2- a]pyr...)
Affinity DataKi:  0.587nM. Assay description: The binding potencies of sGC compounds to the human recombinant sGC enzyme were determined in a Size Exclusion Chromatography (SEC) competition bindi...
Ligand InfoPC cidPC sid
In DepthDetails US Patent