BDBM463272 4-Amino-2-{8-[(3- chlorophenyl)methyl]- imidazo[1,2-a]pyrazin-6- yl}-5-(3-hydroxyphenyl)- 5-methyl-5,7-dihydro-6H- pyrrolo[2,3-d]pyrimidin- 6-one::US10780092, Example 124-B
SMILES CC1(C(=O)Nc2nc(nc(N)c12)-c1cn2ccnc2c(Cc2cccc(Cl)c2)n1)c1cccc(O)c1
InChI Key InChIKey=KORYMFJWUORIRW-UHFFFAOYSA-N
Data  1 KI
  Tab Delimited (TSV)   2D SDfile   Computed 3D by Vconf -m prep SDfile
Find this compound or compounds like it in BindingDB:
Activity Spreadsheet -- Enzyme Inhibition Constant Data from BindingDB
Found 1 hit for monomerid = 463272
TargetGuanylate cyclase soluble subunit alpha-1(Homo sapiens (Human))
Merck Sharp & Dohme
US Patent
LigandPNGBDBM463272(4-Amino-2-{8-[(3- chlorophenyl)methyl]- imidazo[1,...)
Affinity DataKi:  2.63nM. Assay description: The binding potencies of sGC compounds to the human recombinant sGC enzyme were determined in a Size Exclusion Chromatography (SEC) competition bindi...
Ligand InfoPC cidPC sid
In DepthDetails US Patent