BDBM463311 (-)-(3R)-1-(benzimidazol-4- ylmethyl)-N-(9-chloro-3,4- dihydro-2H-1,5- benzodioxepin-7-ylmethyl)-N- isobutylpiperidine-3- carboxamide::US10780095, Structure TABLE 1.9
SMILES CC(C)CN(Cc1cc(Cl)c2OCCCOc2c1)C(=O)C1CCCN(Cc2cccc3nc[nH]c23)C1
InChI Key
Data  2 KI
  Tab Delimited (TSV)   2D SDfile   Computed 3D by Vconf -m prep SDfile
Find this compound or compounds like it in BindingDB:
Activity Spreadsheet -- Enzyme Inhibition Constant Data from BindingDB
Found 2 hits for monomerid = 463311
TargetProkineticin receptor 2(Homo sapiens (Human))
The Regents Of The University Of California
US Patent
LigandPNGBDBM463311((-)-(3R)-1-(benzimidazol-4- ylmethyl)-N-(9-chloro-...)
Affinity DataKi:  3nM. Assay description: An aequorin-based luminescent assay for calcium mobilization was used to measure mobilization of intracellular Ca2+ (Bullock et al., Mol Pharmacol 65...
Ligand InfoPC cidPC sid
In DepthDetails US Patent
TargetProkineticin receptor 1(Homo sapiens (Human))
The Regents Of The University Of California
US Patent
LigandPNGBDBM463311((-)-(3R)-1-(benzimidazol-4- ylmethyl)-N-(9-chloro-...)
Affinity DataKi:  97nM. Assay description: An aequorin-based luminescent assay for calcium mobilization was used to measure mobilization of intracellular Ca2+ (Bullock et al., Mol Pharmacol 65...
Ligand InfoPC cidPC sid
In DepthDetails US Patent