BDBM463329 1-(4-Chloro-benzyl)-3-[3-(2-methyl-2H-pyrazol-3-yl)-4-(2-piperidin-1-yl-ethoxy)-phenyl]-urea::US10781180, Compound 45
SMILES Cn1nccc1-c1cc(NC(=O)NCc2ccc(Cl)cc2)ccc1OCCN1CCCC1
InChI Key InChIKey=RNMSWOXTWSDHHW-UHFFFAOYSA-N
Data  1 IC50
  Tab Delimited (TSV)   2D SDfile   Computed 3D by Vconf -m prep SDfile
Find this compound or compounds like it in BindingDB:
Activity Spreadsheet -- Enzyme Inhibition Constant Data from BindingDB
Found 1 hit for monomerid = 463329
Target5-hydroxytryptamine receptor 2A(Homo sapiens (Human))
Arena Pharmaceuticals
US Patent
LigandPNGBDBM463329(1-(4-Chloro-benzyl)-3-[3-(2-methyl-2H-pyrazol-3-yl...)
Affinity DataIC50:  10.2nM. Assay description: Radioligand binding assays for human 5-HT2A receptor was conducted using the 5-HT2 agonist [125I]DOI as radioligand. To define nonspecific binding, 1...
Ligand InfoPC cidPC sid
In DepthDetails US Patent