BDBM463331 2-(4-Fluoro-phenyl)-N-[3-(2-methyl-2H-pyrazol-3-yl)-4-(2-morpholin-4-yl-ethoxy)-phenyl]-acetamide::US10781180, Compound 160
SMILES Cn1nccc1-c1cc(NC(=O)Cc2ccc(F)cc2)ccc1OCCN1CCCCC1
InChI Key InChIKey=ZQXFJPUHGYJDME-UHFFFAOYSA-N
Data  1 IC50
  Tab Delimited (TSV)   2D SDfile   Computed 3D by Vconf -m prep SDfile
Find this compound or compounds like it in BindingDB:
Activity Spreadsheet -- Enzyme Inhibition Constant Data from BindingDB
Found 1 hit for monomerid = 463331
Target5-hydroxytryptamine receptor 2A(Homo sapiens (Human))
Arena Pharmaceuticals
US Patent
LigandPNGBDBM463331(2-(4-Fluoro-phenyl)-N-[3-(2-methyl-2H-pyrazol-3-yl...)
Affinity DataIC50:  13.7nM. Assay description: Radioligand binding assays for human 5-HT2A receptor was conducted using the 5-HT2 agonist [125I]DOI as radioligand. To define nonspecific binding, 1...
Ligand InfoPC cidPC sid
In DepthDetails US Patent