BDBM463338 N-[2-(3-chlorophenoxy)ethyl]-3-cyclopropyl-1-({4-[(2-oxopyridin-1-::US10781181, Example 5
SMILES Clc1cccc(OCCNC(=O)c2cn(Cc3ccc(Cn4ccccc4=O)cc3)nc2C2CC2)c1
InChI Key InChIKey=IADVHCUBEXJOLV-UHFFFAOYSA-N
Data  2 IC50
  Tab Delimited (TSV)   2D SDfile   Computed 3D by Vconf -m prep SDfile
Find this compound or compounds like it in BindingDB:
Activity Spreadsheet -- Enzyme Inhibition Constant Data from BindingDB
Found 2 hits for monomerid = 463338
TargetKallikrein-1(Homo sapiens (Human))
Kalvista Pharmaceuticals
US Patent
LigandPNGBDBM463338(N-[2-(3-chlorophenoxy)ethyl]-3-cyclopropyl-1-({4-[...)
Affinity DataIC50: >1.00E+4nM. Assay description: KLK1 inhibitory activity in vitro was determined using standard published methods. Human KLK1 (Callbiochem) was incubated at 25° C. with the fluoroge...
Ligand InfoPC cidPC sid
In DepthDetails US Patent
TargetPlasma kallikrein(Homo sapiens (Human))
Kalvista Pharmaceuticals
US Patent
LigandPNGBDBM463338(N-[2-(3-chlorophenoxy)ethyl]-3-cyclopropyl-1-({4-[...)
Affinity DataIC50:  68.4nM. Assay description: Plasma kallikrein inhibitory activity in vitro was determined using standard published methods. Human plasma kallikrein (Protogen) was incubated at 2...
Ligand InfoPC cidPC sid
In DepthDetails US Patent