BDBM46334 5-[(2-chloranylphenoxy)methyl]furan-2-carboxylic acid::5-[(2-chlorophenoxy)methyl]-2-furancarboxylic acid::5-[(2-chlorophenoxy)methyl]-2-furoic acid::5-[(2-chlorophenoxy)methyl]furan-2-carboxylic acid::UNM000011074701::cid_756936
SMILES OC(=O)c1ccc(COc2ccccc2Cl)o1
InChI Key InChIKey=DLWYYIUBVKLTQZ-UHFFFAOYSA-N
Data  1 EC50
  Tab Delimited (TSV)   2D SDfile   Computed 3D by Vconf -m prep SDfile
Find this compound or compounds like it in BindingDB:
Activity Spreadsheet -- Enzyme Inhibition Constant Data from BindingDB
Found 1 hit for monomerid = 46334
LigandPNGBDBM46334(5-[(2-chloranylphenoxy)methyl]furan-2-carboxylic a...)
Affinity DataEC50:  2.63E+4nM. Assay description: University of New Mexico Assay Overview: Assay Support: NIH I RO3 MH081231-01 HTS to identify specific small molecule inhibitors of Ras and Ras-rela...
In DepthDetails PCBioAssay