BDBM463405 3-amino-N-[2-(3-chlorophenoxy)ethyl]-1-[(4-::US10781181, Example 83
SMILES CN(C)C(=O)N(C)Cc1ccc(Cn2cc(C(=O)NCCOc3cccc(Cl)c3)c(N)n2)cc1
InChI Key InChIKey=VOZTXJYHALVILY-UHFFFAOYSA-N
Data  2 IC50
  Tab Delimited (TSV)   2D SDfile   Computed 3D by Vconf -m prep SDfile
Find this compound or compounds like it in BindingDB:
Activity Spreadsheet -- Enzyme Inhibition Constant Data from BindingDB
Found 2 hits for monomerid = 463405
TargetKallikrein-1(Homo sapiens (Human))
Kalvista Pharmaceuticals
US Patent
LigandPNGBDBM463405(3-amino-N-[2-(3-chlorophenoxy)ethyl]-1-[(4- | US10...)
Affinity DataIC50: >4.00E+4nM. Assay description: KLK1 inhibitory activity in vitro was determined using standard published methods. Human KLK1 (Callbiochem) was incubated at 25° C. with the fluoroge...
Ligand InfoPC cidPC sid
In DepthDetails US Patent
TargetPlasma kallikrein(Homo sapiens (Human))
Kalvista Pharmaceuticals
US Patent
LigandPNGBDBM463405(3-amino-N-[2-(3-chlorophenoxy)ethyl]-1-[(4- | US10...)
Affinity DataIC50:  298nM. Assay description: Plasma kallikrein inhibitory activity in vitro was determined using standard published methods. Human plasma kallikrein (Protogen) was incubated at 2...
Ligand InfoPC cidPC sid
In DepthDetails US Patent