BDBM463437 3-amino-N-[(2R)-1-(3-chlorophenoxy)propan-2-yl]-1-({4-[(2-oxopyridin-1-::US10781181, Example 113
SMILES C[C@H](COc1cccc(Cl)c1)NC(=O)c1cn(Cc2ccc(Cn3ccccc3=O)cc2)nc1N
InChI Key InChIKey=WWDYKPQPCZPGFF-GOSISDBHSA-N
Data  2 IC50
  Tab Delimited (TSV)   2D SDfile   Computed 3D by Vconf -m prep SDfile
Find this compound or compounds like it in BindingDB:
Activity Spreadsheet -- Enzyme Inhibition Constant Data from BindingDB
Found 2 hits for monomerid = 463437
TargetKallikrein-1(Homo sapiens (Human))
Kalvista Pharmaceuticals
US Patent
LigandPNGBDBM463437(3-amino-N-[(2R)-1-(3-chlorophenoxy)propan-2-yl]-1-...)
Affinity DataIC50: >4.00E+4nM. Assay description: KLK1 inhibitory activity in vitro was determined using standard published methods. Human KLK1 (Callbiochem) was incubated at 25° C. with the fluoroge...
Ligand InfoPC cidPC sid
In DepthDetails US Patent
TargetPlasma kallikrein(Homo sapiens (Human))
Kalvista Pharmaceuticals
US Patent
LigandPNGBDBM463437(3-amino-N-[(2R)-1-(3-chlorophenoxy)propan-2-yl]-1-...)
Affinity DataIC50:  316nM. Assay description: Plasma kallikrein inhibitory activity in vitro was determined using standard published methods. Human plasma kallikrein (Protogen) was incubated at 2...
Ligand InfoPC cidPC sid
In DepthDetails US Patent