BDBM463459 3-(4-Fluorophenyl)-2-(4-(pyridin-2-yl)piperazin-1-yl)quinoxaline-6-carboxylic acid::US10781185, Example 27::US11459307, Example 27
SMILES OC(=O)c1ccc2nc(N3CCN(CC3)c3ccccn3)c(nc2c1)-c1ccc(F)cc1
InChI Key InChIKey=KPDGUUJODHKQHI-UHFFFAOYSA-N
Data  2 IC50
  Tab Delimited (TSV)   2D SDfile   Computed 3D by Vconf -m prep SDfile
Find this compound or compounds like it in BindingDB:
Activity Spreadsheet -- Enzyme Inhibition Constant Data from BindingDB
Found 2 hits for monomerid = 463459
TargetPAS domain-containing serine/threonine-protein kinase(Homo sapiens (Human))
Bioenergenix
US Patent
LigandPNGBDBM463459(3-(4-Fluorophenyl)-2-(4-(pyridin-2-yl)piperazin-1-...)
Affinity DataIC50: <1.00E+4nM. Assay description: One assay for purified hPASK activity utilizes the Kinase-Glo Luminescent Kinase Assay (Promega), which quantifies the amount of ATP remaining in sol...
Ligand InfoPC cidPC sid
In DepthDetails US Patent
TargetPAS domain-containing serine/threonine-protein kinase(Homo sapiens (Human))
Bioenergenix
US Patent
LigandPNGBDBM463459(3-(4-Fluorophenyl)-2-(4-(pyridin-2-yl)piperazin-1-...)
Affinity DataIC50: <1.00E+3nM. Assay description: Purified hPASK from insect cells (0.02 μg) is added to a 50 μL reaction mix containing 40 mM HEPES (pH 7.0), 100 mM KCl, 5 mM MgCl2, 1 mM D...
Ligand InfoPC cidPC sid
In DepthDetails US Patent