BDBM463473 3-(4-(3-Chlorophenyl)piperidin-1-yl)-2-phenylquinoxaline-6-carboxylic acid::US10781185, Example 10::US11459307, Example 10
SMILES OC(=O)c1ccc2nc(-c3ccccc3)c(nc2c1)N1CCC(CC1)c1cccc(Cl)c1
InChI Key InChIKey=SWHUGSSYBZZLMR-UHFFFAOYSA-N
Data  2 IC50
  Tab Delimited (TSV)   2D SDfile   Computed 3D by Vconf -m prep SDfile
Find this compound or compounds like it in BindingDB:
Activity Spreadsheet -- Enzyme Inhibition Constant Data from BindingDB
Found 2 hits for monomerid = 463473
TargetPAS domain-containing serine/threonine-protein kinase [879-1323](Homo sapiens (Human))
Bioenergenix
US Patent
LigandPNGBDBM463473(3-(4-(3-Chlorophenyl)piperidin-1-yl)-2-phenylquino...)
Affinity DataIC50: <1.00E+4nM. Assay description: Purified PASK (UniProt #Q96RG2; human recombinant N-terminal GST tagged construct, residues 879-1323) from insect cells (final concentration 5 nM) is...
Ligand InfoPC cidPC sid
In DepthDetails US Patent
TargetPAS domain-containing serine/threonine-protein kinase(Homo sapiens (Human))
Bioenergenix
US Patent
LigandPNGBDBM463473(3-(4-(3-Chlorophenyl)piperidin-1-yl)-2-phenylquino...)
Affinity DataIC50: <1.00E+3nM. Assay description: Purified PASK (UniProt # Q96RG2; human recombinant N-terminal GST tagged construct, residues 879-1323) from insect cells (final concentration 5 nM) i...
Ligand InfoPC cidPC sid
In DepthDetails US Patent