BDBM463474 2-Phenyl-3-(piperidin-1-yl)quinoxaline-6-carboxylic acid::US10781185, Example 12::US11459307, Example 12
SMILES OC(=O)c1ccc2nc(-c3ccccc3)c(nc2c1)N1CCCCC1
InChI Key InChIKey=QNWSYLAQEPRNTF-UHFFFAOYSA-N
Data  2 IC50
  Tab Delimited (TSV)   2D SDfile   Computed 3D by Vconf -m prep SDfile
Find this compound or compounds like it in BindingDB:
Activity Spreadsheet -- Enzyme Inhibition Constant Data from BindingDB
Found 2 hits for monomerid = 463474
TargetPAS domain-containing serine/threonine-protein kinase [879-1323](Homo sapiens (Human))
Bioenergenix
US Patent
LigandPNGBDBM463474(2-Phenyl-3-(piperidin-1-yl)quinoxaline-6-carboxyli...)
Affinity DataIC50: <1.00E+4nM. Assay description: Purified PASK (UniProt #Q96RG2; human recombinant N-terminal GST tagged construct, residues 879-1323) from insect cells (final concentration 5 nM) is...
Ligand InfoPC cidPC sid
In DepthDetails US Patent
TargetPAS domain-containing serine/threonine-protein kinase(Homo sapiens (Human))
Bioenergenix
US Patent
LigandPNGBDBM463474(2-Phenyl-3-(piperidin-1-yl)quinoxaline-6-carboxyli...)
Affinity DataIC50: <1.00E+3nM. Assay description: Purified PASK (UniProt # Q96RG2; human recombinant N-terminal GST tagged construct, residues 879-1323) from insect cells (final concentration 5 nM) i...
Ligand InfoPC cidPC sid
In DepthDetails US Patent