BDBM463481 3-(Cyclopropyl(methyl)amino)-2-phenylquinoxaline-6-carboxylic acid::US10781185, Example 46::US11459307, Example 46
SMILES CN(C1CC1)c1nc2cc(ccc2nc1-c1ccccc1)C(O)=O
InChI Key InChIKey=IITMEKDTKBWXSY-UHFFFAOYSA-N
Data  4 IC50
  Tab Delimited (TSV)   2D SDfile   Computed 3D by Vconf -m prep SDfile
Find this compound or compounds like it in BindingDB:
Activity Spreadsheet -- Enzyme Inhibition Constant Data from BindingDB
Found 4 hits for monomerid = 463481
TargetPAS domain-containing serine/threonine-protein kinase(Homo sapiens (Human))
Bioenergenix
US Patent
LigandPNGBDBM463481(3-(Cyclopropyl(methyl)amino)-2-phenylquinoxaline-6...)
Affinity DataIC50: <1.00E+3nM. Assay description: Purified PASK (UniProt # Q96RG2; human recombinant N-terminal GST tagged construct, residues 879-1323) from insect cells (final concentration 5 nM) i...
Ligand InfoPC cidPC sid
In DepthDetails US Patent
TargetPAS domain-containing serine/threonine-protein kinase(Homo sapiens (Human))
Bioenergenix
US Patent
LigandPNGBDBM463481(3-(Cyclopropyl(methyl)amino)-2-phenylquinoxaline-6...)
Affinity DataIC50: <1.00E+4nM. Assay description: The aim of the FRET assay is to determine the inhibition potential of test compounds on targeted kinase. This assay platform provides a homogenous sc...
Ligand InfoPC cidPC sid
In DepthDetails US Patent
TargetPAS domain-containing serine/threonine-protein kinase [879-1323](Homo sapiens (Human))
Bioenergenix
US Patent
LigandPNGBDBM463481(3-(Cyclopropyl(methyl)amino)-2-phenylquinoxaline-6...)
Affinity DataIC50: <1.00E+4nM. Assay description: Purified PASK (UniProt #Q96RG2; human recombinant N-terminal GST tagged construct, residues 879-1323) from insect cells (final concentration 5 nM) is...
Ligand InfoPC cidPC sid
In DepthDetails US Patent
TargetPAS domain-containing serine/threonine-protein kinase(Homo sapiens (Human))
Bioenergenix
US Patent
LigandPNGBDBM463481(3-(Cyclopropyl(methyl)amino)-2-phenylquinoxaline-6...)
Affinity DataIC50: <1.00E+3nM. Assay description: Compound screening was done via the following method. 10 mM stock solution of test compound in DMSO was prepared by dissolving test compound in DMSO ...
Ligand InfoPC cidPC sid
In DepthDetails US Patent