BDBM46349 4-butoxy-N-(4-pyridyl)benzamide::4-butoxy-N-4-pyridinylbenzamide::4-butoxy-N-pyridin-4-yl-benzamide::4-butoxy-N-pyridin-4-ylbenzamide::MLS000100092::SMR000081849::cid_2232224
SMILES CCCCOc1ccc(cc1)C(=O)Nc1ccncc1
InChI Key InChIKey=YZZMLZCSPXWQRI-UHFFFAOYSA-N
Data  2 IC50
  Tab Delimited (TSV)   2D SDfile   Computed 3D by Vconf -m prep SDfile
Find this compound or compounds like it in BindingDB:
Activity Spreadsheet -- Enzyme Inhibition Constant Data from BindingDB
Found 2 hits for monomerid = 46349
TargetSignal transducer and activator of transcription 1-alpha/beta(Homo sapiens (Human))
The Scripps Research Institute Molecular Screening Center
Curated by PubChem BioAssay
LigandPNGBDBM46349(4-butoxy-N-(4-pyridyl)benzamide | 4-butoxy-N-4-pyr...)
Affinity DataIC50: >5.57E+4nM. Assay description: Source (MLPCN Center Name): The Scripps Research Institute Molecular Screening Center Center Affiliation: The Scripps Research Institute (TSRI) Assay...
In DepthDetails PCBioAssay
TargetSignal transducer and activator of transcription 3 [702-738,740-752](Homo sapiens (Human))
The Scripps Research Institute Molecular Screening Center
Curated by PubChem BioAssay
LigandPNGBDBM46349(4-butoxy-N-(4-pyridyl)benzamide | 4-butoxy-N-4-pyr...)
Affinity DataIC50:  2.11E+3nM. Assay description: Source (MLPCN Center Name): The Scripps Research Institute Molecular Screening Center Center Affiliation: The Scripps Research Institute (TSRI) Assay...
In DepthDetails PCBioAssay