BDBM463493 Butyl 2-(4-fluorophenyl)-3-(piperidin-1-yl)quinoxaline-6-carboxylate::US10781185, Example 75
SMILES CCCCOC(=O)c1ccc2nc(-c3ccc(F)cc3)c(nc2c1)N1CCCCC1
InChI Key InChIKey=LNTSWYUOHQDHBB-UHFFFAOYSA-N
Data  2 IC50
  Tab Delimited (TSV)   2D SDfile   Computed 3D by Vconf -m prep SDfile
Find this compound or compounds like it in BindingDB:
Activity Spreadsheet -- Enzyme Inhibition Constant Data from BindingDB
Found 2 hits for monomerid = 463493
TargetPAS domain-containing serine/threonine-protein kinase(Homo sapiens (Human))
Bioenergenix
US Patent
LigandPNGBDBM463493(Butyl 2-(4-fluorophenyl)-3-(piperidin-1-yl)quinoxa...)
Affinity DataIC50: <1.00E+3nM. Assay description: Compound screening was done via the following method. 10 mM stock solution of test compound in DMSO was prepared by dissolving test compound in DMSO ...
Ligand InfoPC cidPC sid
In DepthDetails US Patent
TargetPAS domain-containing serine/threonine-protein kinase(Homo sapiens (Human))
Bioenergenix
US Patent
LigandPNGBDBM463493(Butyl 2-(4-fluorophenyl)-3-(piperidin-1-yl)quinoxa...)
Affinity DataIC50: <1.00E+3nM. Assay description: Purified PASK (UniProt # Q96RG2; human recombinant N-terminal GST tagged construct, residues 879-1323) from insect cells (final concentration 5 nM) i...
Ligand InfoPC cidPC sid
In DepthDetails US Patent