BDBM463771 US10787419, Compound 3
SMILES CC(C)(C)C(=N)N\C(=N/S(=O)(=O)c1ccc(Cl)cc1)N1CC(C(=N1)c1ccc(Cl)cc1)c1ccccc1
InChI Key InChIKey=PMKIBLHYLBPREW-UHFFFAOYSA-N
Data  1 KI
  Tab Delimited (TSV)   2D SDfile   Computed 3D by Vconf -m prep SDfile
Find this compound or compounds like it in BindingDB:
Activity Spreadsheet -- Enzyme Inhibition Constant Data from BindingDB
Found 1 hit for monomerid = 463771
TargetCannabinoid receptor 1(Mus musculus (Mouse))
The United States Of America, As Represented By The Secretary, Department Of Health And Human Services
US Patent
LigandPNGBDBM463771(US10787419, Compound 3)
Affinity DataKi:  7nM. Assay description: Measuring its tissue levels 1 hour after administration of 10 mg/kg to mice, plasma levels were comparable after oral or i.p. administration (indicat...
Ligand InfoPC cidPC sid
In DepthDetails US Patent