BDBM46387 5-[(2,4-dichlorophenoxy)methyl]-3-phenyl-1,2-oxazole::5-[(2,4-dichlorophenoxy)methyl]-3-phenyl-isoxazole::5-[(2,4-dichlorophenoxy)methyl]-3-phenylisoxazole::5-[[2,4-bis(chloranyl)phenoxy]methyl]-3-phenyl-1,2-oxazole::MLS000326400::SMR000178976::cid_1480809
SMILES Clc1ccc(OCc2cc(no2)-c2ccccc2)c(Cl)c1
InChI Key InChIKey=LZTFBZHIRAVIKX-UHFFFAOYSA-N
Data  4 IC50
  Tab Delimited (TSV)   2D SDfile   Computed 3D by Vconf -m prep SDfile
Find this compound or compounds like it in BindingDB:
Activity Spreadsheet -- Enzyme Inhibition Constant Data from BindingDB
Found 4 hits for monomerid = 46387
TargetSignal transducer and activator of transcription 3 [702-738,740-752](Homo sapiens (Human))
The Scripps Research Institute Molecular Screening Center
Curated by PubChem BioAssay
LigandPNGBDBM46387(5-[(2,4-dichlorophenoxy)methyl]-3-phenyl-1,2-oxazo...)
Affinity DataIC50:  8.02E+3nM. Assay description: Source (MLPCN Center Name): The Scripps Research Institute Molecular Screening Center Center Affiliation: The Scripps Research Institute (TSRI) Assay...
In DepthDetails PCBioAssay
TargetSteroidogenic factor 1(Homo sapiens (Human))
The Scripps Research Institute Molecular Screening Center
Curated by PubChem BioAssay
LigandPNGBDBM46387(5-[(2,4-dichlorophenoxy)methyl]-3-phenyl-1,2-oxazo...)
Affinity DataIC50: >6.75E+4nM
In DepthDetails PCBioAssay
TargetNuclear receptor subfamily 0 group B member 1(Homo sapiens (Human))
The Scripps Research Institute Molecular Screening Center
Curated by PubChem BioAssay
LigandPNGBDBM46387(5-[(2,4-dichlorophenoxy)methyl]-3-phenyl-1,2-oxazo...)
Affinity DataIC50: >6.75E+4nM
In DepthDetails PCBioAssay
TargetSignal transducer and activator of transcription 1-alpha/beta(Homo sapiens (Human))
The Scripps Research Institute Molecular Screening Center
Curated by PubChem BioAssay
LigandPNGBDBM46387(5-[(2,4-dichlorophenoxy)methyl]-3-phenyl-1,2-oxazo...)
Affinity DataIC50:  1.78E+4nM. Assay description: Source (MLPCN Center Name): The Scripps Research Institute Molecular Screening Center Center Affiliation: The Scripps Research Institute (TSRI) Assay...
In DepthDetails PCBioAssay