BDBM463964 US10787425, Compound 90
SMILES Clc1c(OC(=O)CCCCc2ccccc2)cccc1\C=C1/SC(=O)NC1=O
InChI Key InChIKey=SFHSWSPVJSYTPS-LGMDPLHJSA-N
Data  1 IC50
  Tab Delimited (TSV)   2D SDfile   Computed 3D by Vconf -m prep SDfile
Find this compound or compounds like it in BindingDB:
Activity Spreadsheet -- Enzyme Inhibition Constant Data from BindingDB
Found 1 hit for monomerid = 463964
Target15-hydroxyprostaglandin dehydrogenase [NAD(+)](Homo sapiens (Human))
Industry-Academic Cooperation Foundation Chosun University
US Patent
LigandPNGBDBM463964(US10787425, Compound 90)
Affinity DataIC50:  46nM. Assay description: To confirm whether the compounds according to the present disclosure have an effect of inhibiting 15-PGDH, the NADH, which appears at the wavelength ...
Ligand InfoPC cidPC sid
In DepthDetails US Patent