BDBM463976 US10787425, Compound 100
SMILES Clc1cc(OC(=O)CCCCC2CCCCC2)ccc1\C=C1/SC(=O)NC1=O
InChI Key InChIKey=YCEZFGQSJWZMCJ-PDGQHHTCSA-N
Data  1 IC50
  Tab Delimited (TSV)   2D SDfile   Computed 3D by Vconf -m prep SDfile
Find this compound or compounds like it in BindingDB:
Activity Spreadsheet -- Enzyme Inhibition Constant Data from BindingDB
Found 1 hit for monomerid = 463976
Target15-hydroxyprostaglandin dehydrogenase [NAD(+)](Homo sapiens (Human))
Industry-Academic Cooperation Foundation Chosun University
US Patent
LigandPNGBDBM463976(US10787425, Compound 100)
Affinity DataIC50:  39.4nM. Assay description: To confirm whether the compounds according to the present disclosure have an effect of inhibiting 15-PGDH, the NADH, which appears at the wavelength ...
Ligand InfoPC cidPC sid
In DepthDetails US Patent