BDBM464024 US10787435, Example 010::WX010
SMILES O=C1N(CCc2ccc(cc12)-n1cnc2CCCCc12)c1cccc(n1)-c1nnc2CCCCn12
InChI Key InChIKey=BSYXMIRKBJAMNF-UHFFFAOYSA-N
Data  1 IC50
  Tab Delimited (TSV)   2D SDfile   Computed 3D by Vconf -m prep SDfile
Find this compound or compounds like it in BindingDB:
Activity Spreadsheet -- Enzyme Inhibition Constant Data from BindingDB
Found 1 hit for monomerid = 464024
TargetMitogen-activated protein kinase kinase kinase 5(Homo sapiens (Human))
Fuijan Cosunter Pharmaceutical
US Patent
LigandPNGBDBM464024(US10787435, Example 010 | WX010)
Affinity DataIC50:  525nM. Assay description: Reagents:Base Reaction Buffer: 20 mM Hepes (pH 7.5), 10 mM MgCl2, 1 mM EGTA, 0.02% Brij35, 0.02 mg/ml BSA, 0.1 mM Na3VO4, 2 mM DTT, 1% DMSOCompound T...
Ligand InfoPC cidPC sid
In DepthDetails US Patent