BDBM464043 US10787435, Example 020::WX020
SMILES Cc1nnc(o1)-c1cccc(n1)-n1cnc2cc(C)c(cc2c1=O)-n1cnc(c1)C1CC1
InChI Key InChIKey=GEGAZDXEYUJHSK-UHFFFAOYSA-N
Data  1 IC50
  Tab Delimited (TSV)   2D SDfile   Computed 3D by Vconf -m prep SDfile
Find this compound or compounds like it in BindingDB:
Activity Spreadsheet -- Enzyme Inhibition Constant Data from BindingDB
Found 1 hit for monomerid = 464043
TargetMitogen-activated protein kinase kinase kinase 5(Homo sapiens (Human))
Fuijan Cosunter Pharmaceutical
US Patent
LigandPNGBDBM464043(US10787435, Example 020 | WX020)
Affinity DataIC50: >1.00E+3nM. Assay description: Reagents:Base Reaction Buffer: 20 mM Hepes (pH 7.5), 10 mM MgCl2, 1 mM EGTA, 0.02% Brij35, 0.02 mg/ml BSA, 0.1 mM Na3VO4, 2 mM DTT, 1% DMSOCompound T...
Ligand InfoPC cidPC sid
In DepthDetails US Patent