BDBM464051 US10787435, Example 029::WX028
SMILES COc1nc2cc(C)c(cc2c(=O)n1-c1cccc(n1)-c1nncn1C(C)C)-n1cnc(c1)C1CC1
InChI Key InChIKey=IVGCFCHWFVXPJD-UHFFFAOYSA-N
Data  1 IC50
  Tab Delimited (TSV)   2D SDfile   Computed 3D by Vconf -m prep SDfile
Find this compound or compounds like it in BindingDB:
Activity Spreadsheet -- Enzyme Inhibition Constant Data from BindingDB
Found 1 hit for monomerid = 464051
TargetMitogen-activated protein kinase kinase kinase 5(Homo sapiens (Human))
Fuijan Cosunter Pharmaceutical
US Patent
LigandPNGBDBM464051(US10787435, Example 029 | WX028)
Affinity DataIC50: >1.00E+3nM. Assay description: Reagents:Base Reaction Buffer: 20 mM Hepes (pH 7.5), 10 mM MgCl2, 1 mM EGTA, 0.02% Brij35, 0.02 mg/ml BSA, 0.1 mM Na3VO4, 2 mM DTT, 1% DMSOCompound T...
Ligand InfoPC cidPC sid
In DepthDetails US Patent