BDBM46428 1-[5-(4-benzylpiperidin-1-yl)sulfonylpyridin-2-yl]piperidine-4-carboxamide::1-[5-(4-benzylpiperidino)sulfonyl-2-pyridyl]isonipecotamide::1-[5-[4-(phenylmethyl)piperidin-1-yl]sulfonylpyridin-2-yl]piperidine-4-carboxamide::1-[5-[[4-(phenylmethyl)-1-piperidinyl]sulfonyl]-2-pyridinyl]-4-piperidinecarboxamide::MLS001002727::SMR000369178::cid_4877575
SMILES NC(=O)C1CCN(CC1)c1ccc(cn1)S(=O)(=O)N1CCC(Cc2ccccc2)CC1
InChI Key InChIKey=ARRKLZLOSBNCGW-UHFFFAOYSA-N
Data  6 IC50  1 EC50
  Tab Delimited (TSV)   2D SDfile   Computed 3D by Vconf -m prep SDfile
Find this compound or compounds like it in BindingDB:
Activity Spreadsheet -- Enzyme Inhibition Constant Data from BindingDB
Found 7 hits for monomerid = 46428
TargetSignal transducer and activator of transcription 3 [702-738,740-752](Homo sapiens (Human))
The Scripps Research Institute Molecular Screening Center
Curated by PubChem BioAssay
LigandPNGBDBM46428(1-[5-(4-benzylpiperidin-1-yl)sulfonylpyridin-2-yl]...)
Affinity DataIC50:  4.93E+3nM. Assay description: Source (MLPCN Center Name): The Scripps Research Institute Molecular Screening Center Center Affiliation: The Scripps Research Institute (TSRI) Assay...
In DepthDetails PCBioAssay
TargetSignal transducer and activator of transcription 1-alpha/beta(Homo sapiens (Human))
The Scripps Research Institute Molecular Screening Center
Curated by PubChem BioAssay
LigandPNGBDBM46428(1-[5-(4-benzylpiperidin-1-yl)sulfonylpyridin-2-yl]...)
Affinity DataIC50: >5.57E+4nM. Assay description: Source (MLPCN Center Name): The Scripps Research Institute Molecular Screening Center Center Affiliation: The Scripps Research Institute (TSRI) Assay...
In DepthDetails PCBioAssay
TargetNucleotide-binding oligomerization domain-containing protein 1(Homo sapiens (Human))
Burnham Center For Chemical Genomics
Curated by PubChem BioAssay
LigandPNGBDBM46428(1-[5-(4-benzylpiperidin-1-yl)sulfonylpyridin-2-yl]...)
Affinity DataEC50:  4.32E+3nM. Assay description: Data Source: Sanford-Burnham Center for Chemical Genomics (SBCCG) Source Affiliation: Sanford-Burnham Medical Research Institute (SBMRI, San Diego, C...
In DepthDetails PCBioAssay
TargetTumor necrosis factor(Homo sapiens (Human))
Burnham Center For Chemical Genomics
Curated by PubChem BioAssay
LigandPNGBDBM46428(1-[5-(4-benzylpiperidin-1-yl)sulfonylpyridin-2-yl]...)
Affinity DataIC50:  2.00E+4nM. Assay description: Data Source: Sanford-Burnham Center for Chemical Genomics (SBCCG) Source Affiliation: Sanford-Burnham Medical Research Institute (SBMRI, San Diego, C...
In DepthDetails PCBioAssay
TargetNucleotide-binding oligomerization domain-containing protein 2(Homo sapiens (Human))
Burnham Center For Chemical Genomics
Curated by PubChem BioAssay
LigandPNGBDBM46428(1-[5-(4-benzylpiperidin-1-yl)sulfonylpyridin-2-yl]...)
Affinity DataIC50:  9.14E+3nM. Assay description: Data Source: Sanford-Burnham Center for Chemical Genomics (SBCCG) Source Affiliation: Sanford-Burnham Medical Research Institute (SBMRI, San Diego, C...
In DepthDetails PCBioAssay
TargetTumor necrosis factor(Homo sapiens (Human))
Burnham Center For Chemical Genomics
Curated by PubChem BioAssay
LigandPNGBDBM46428(1-[5-(4-benzylpiperidin-1-yl)sulfonylpyridin-2-yl]...)
Affinity DataIC50:  1.24E+4nM. Assay description: Data Source: Sanford-Burnham Center for Chemical Genomics (SBCCG) Source Affiliation: Sanford-Burnham Medical Research Institute (SBMRI, San Diego, C...
In DepthDetails PCBioAssay
TargetNucleotide-binding oligomerization domain-containing protein 1(Homo sapiens (Human))
Burnham Center For Chemical Genomics
Curated by PubChem BioAssay
LigandPNGBDBM46428(1-[5-(4-benzylpiperidin-1-yl)sulfonylpyridin-2-yl]...)
Affinity DataIC50:  5.76E+3nM. Assay description: Data Source: Sanford-Burnham Center for Chemical Genomics (SBCCG) Source Affiliation: Sanford-Burnham Medical Research Institute (SBMRI, San Diego, C...
In DepthDetails PCBioAssay