BDBM464356 3-(6-methoxy- 5-(1H- pyrazol-4- yl)pyridin- 2-yl)-1-(3- methoxy- benzyl)-8- (oxetan-3- yl)-1,3,8- triazaspiro [4.5]decan- 2-one::US10787450, Example 238
SMILES COc1cccc(CN2C(=O)N(CC22CCN(CC2)C2COC2)c2ccc(-c3cn[nH]c3)c(OC)n2)c1
InChI Key InChIKey=JYDXQTFNIUJTPP-UHFFFAOYSA-N
Data  1 IC50
  Tab Delimited (TSV)   2D SDfile   Computed 3D by Vconf -m prep SDfile
Find this compound or compounds like it in BindingDB:
Activity Spreadsheet -- Enzyme Inhibition Constant Data from BindingDB
Found 1 hit for monomerid = 464356
TargetRho-associated protein kinase 2(Homo sapiens (Human))
Bristol-Myers Squibb
US Patent
LigandPNGBDBM464356(3-(6-methoxy- 5-(1H- pyrazol-4- yl)pyridin- 2-yl)-...)
Affinity DataIC50: <3nM. Assay description: The effectiveness of compounds of the present invention as ROCK inhibitors can be determined in a 30 μL assay containing 20 mM HEPES, pH 7.5, 20...
Ligand InfoPC cidPC sid
In DepthDetails US Patent