BDBM464460 US10793528, Example SC_5030
SMILES CN[C@]1(CC[C@]2(CN(CCC(=O)Nc3cccnn3)C(=O)N2CC2(O)CCC2)CC1)c1ccccc1
InChI Key InChIKey=XGXYPECOPWANJS-LDNJAJMQSA-N
Data  2 KI
  Tab Delimited (TSV)   2D SDfile   Computed 3D by Vconf -m prep SDfile
Find this compound or compounds like it in BindingDB:
Activity Spreadsheet -- Enzyme Inhibition Constant Data from BindingDB
Found 2 hits for monomerid = 464460
TargetPrepronociceptin(Human)
GrÜNenthal
US Patent
LigandPNGBDBM464460(US10793528, Example SC_5030)
Affinity DataKi:  20nM. Assay description: NOP:The hNOP receptor binding assay was performed as homogeneous SPA-assay (scintillation proximity assay) using the assay buffer 50 mM TRIS-HCl. 10 ...
Ligand InfoPC cidPC sid
In DepthDetails US Patent
TargetMu-type opioid receptor(Homo sapiens (Human))
GrÜNenthal
US Patent
LigandPNGBDBM464460(US10793528, Example SC_5030)
Affinity DataKi:  810nM. Assay description: MOP: The hMOP receptor binding assay was performed as homogeneous SPA-assay (scintillation proximity assay) using the assay buffer 50 mM TRIS-HCl (pH...
Ligand InfoPC cidPC sid
In DepthDetails US Patent