BDBM464493 US10793528, Example SC_5067
SMILES CN[C@]1(CC[C@]2(CN(CC(C)(C)C(N)=O)C(=O)N2)CC1)c1ccccc1
InChI Key InChIKey=BDRAJENDQZJWOH-BGYRXZFFSA-N
Data  1 KI
  Tab Delimited (TSV)   2D SDfile   Computed 3D by Vconf -m prep SDfile
Find this compound or compounds like it in BindingDB:
Activity Spreadsheet -- Enzyme Inhibition Constant Data from BindingDB
Found 1 hit for monomerid = 464493
TargetPrepronociceptin(Human)
GrÜNenthal
US Patent
LigandPNGBDBM464493(US10793528, Example SC_5067)
Affinity DataKi:  1.30E+3nM. Assay description: NOP:The hNOP receptor binding assay was performed as homogeneous SPA-assay (scintillation proximity assay) using the assay buffer 50 mM TRIS-HCl. 10 ...
Ligand InfoPC cidPC sid
In DepthDetails US Patent