BDBM464503 US10793528, Example SC_5078
SMILES CN(C)[C@]1(CC[C@]2(CN(CC(C)(C)C(N)=O)C(=O)N2CC2(CCC2)C#N)CC1)c1ccccc1
InChI Key InChIKey=CJJNDFMHJQGFNW-MKPDMIMOSA-N
Data  2 KI
  Tab Delimited (TSV)   2D SDfile   Computed 3D by Vconf -m prep SDfile
Find this compound or compounds like it in BindingDB:
Activity Spreadsheet -- Enzyme Inhibition Constant Data from BindingDB
Found 2 hits for monomerid = 464503
TargetPrepronociceptin(Human)
GrÜNenthal
US Patent
LigandPNGBDBM464503(US10793528, Example SC_5078)
Affinity DataKi:  0.5nM. Assay description: NOP:The hNOP receptor binding assay was performed as homogeneous SPA-assay (scintillation proximity assay) using the assay buffer 50 mM TRIS-HCl. 10 ...
Ligand InfoPC cidPC sid
In DepthDetails US Patent
TargetMu-type opioid receptor(Homo sapiens (Human))
GrÜNenthal
US Patent
LigandPNGBDBM464503(US10793528, Example SC_5078)
Affinity DataKi:  180nM. Assay description: MOP: The hMOP receptor binding assay was performed as homogeneous SPA-assay (scintillation proximity assay) using the assay buffer 50 mM TRIS-HCl (pH...
Ligand InfoPC cidPC sid
In DepthDetails US Patent