BDBM464507 US10793528, Example SC_5083
SMILES CN(C)C(=O)CCN1C[C@]2(CC[C@@](CC2)(N(C)C)c2cccc(F)c2)N(CC2CC2)C1=O
InChI Key InChIKey=CTQQNFCCLUITBF-PLQXJYEYSA-N
Data  2 KI
  Tab Delimited (TSV)   2D SDfile   Computed 3D by Vconf -m prep SDfile
Find this compound or compounds like it in BindingDB:
Activity Spreadsheet -- Enzyme Inhibition Constant Data from BindingDB
Found 2 hits for monomerid = 464507
TargetPrepronociceptin(Human)
GrÜNenthal
US Patent
LigandPNGBDBM464507(US10793528, Example SC_5083)
Affinity DataKi:  22nM. Assay description: NOP:The hNOP receptor binding assay was performed as homogeneous SPA-assay (scintillation proximity assay) using the assay buffer 50 mM TRIS-HCl. 10 ...
Ligand InfoPC cidPC sid
In DepthDetails US Patent
TargetMu-type opioid receptor(Homo sapiens (Human))
GrÜNenthal
US Patent
LigandPNGBDBM464507(US10793528, Example SC_5083)
Affinity DataKi:  610nM. Assay description: MOP: The hMOP receptor binding assay was performed as homogeneous SPA-assay (scintillation proximity assay) using the assay buffer 50 mM TRIS-HCl (pH...
Ligand InfoPC cidPC sid
In DepthDetails US Patent