BDBM464589 CIS-1-(Cyclobutyl-methyl)-8-dimethylamino-3-(2-methylsulfonyl-ethyl)-8-phenyl- 1,3-diazaspiro[4.5]decan-2-one::US10793556, Example SC_4009
SMILES CN(C)[C@]1(CC[C@]2(CN(CCS(C)(=O)=O)C(=O)N2CC2CCC2)CC1)c1ccccc1
InChI Key InChIKey=ABQSWYTUNPFJPX-PSWAGMNNSA-N
Data  2 KI
  Tab Delimited (TSV)   2D SDfile   Computed 3D by Vconf -m prep SDfile
Find this compound or compounds like it in BindingDB:
Activity Spreadsheet -- Enzyme Inhibition Constant Data from BindingDB
Found 2 hits for monomerid = 464589
TargetNociceptin receptor(Homo sapiens (Human))
Gruenenthal
US Patent
LigandPNGBDBM464589(CIS-1-(Cyclobutyl-methyl)-8-dimethylamino-3-(2-met...)
Affinity DataKi:  1.10nM. Assay description: The hNOP receptor binding assay was performed as homogeneous SPA-assay (scintillation proximity assay) using the assay buffer 50 mM TRIS-HCl. 10 mM M...
Ligand InfoPC cidPC sid
In DepthDetails US Patent
TargetMu-type opioid receptor(Homo sapiens (Human))
Gruenenthal
US Patent
LigandPNGBDBM464589(CIS-1-(Cyclobutyl-methyl)-8-dimethylamino-3-(2-met...)
Affinity DataKi:  37.4nM. Assay description: The hMOP receptor binding assay was performed as homogeneous SPA-assay (scintillation proximity assay) using the assay buffer 50 mM TRIS-HCl (pH 7.4)...
Ligand InfoPC cidPC sid
In DepthDetails US Patent