BDBM46467 2-methyl-N-[1-methyl-2-[2-(4-methyl-1-piperazinyl)ethyl]-5-benzimidazolyl]propanamide::2-methyl-N-[1-methyl-2-[2-(4-methylpiperazin-1-yl)ethyl]benzimidazol-5-yl]propanamide::2-methyl-N-[1-methyl-2-[2-(4-methylpiperazino)ethyl]benzimidazol-5-yl]propionamide::MLS000559048::N-{1-Methyl-2-[2-(4-methyl-piperazin-1-yl)-ethyl]-1H-benzoimidazol-5-yl}-isobutyramide::SMR000149364::cid_4888292
SMILES CC(C)C(=O)Nc1ccc2n(C)c(CCN3CCN(C)CC3)nc2c1
InChI Key InChIKey=QLKUILUSFPFJTO-UHFFFAOYSA-N
Data  2 EC50
  Tab Delimited (TSV)   2D SDfile   Computed 3D by Vconf -m prep SDfile
Find this compound or compounds like it in BindingDB:
Activity Spreadsheet -- Enzyme Inhibition Constant Data from BindingDB
Found 2 hits for monomerid = 46467
TargetEukaryotic translation initiation factor 2-alpha kinase 3(Homo sapiens (Human))
The Scripps Research Institute Molecular Screening Center
Curated by PubChem BioAssay
LigandPNGBDBM46467(2-methyl-N-[1-methyl-2-[2-(4-methyl-1-piperazinyl)...)
Affinity DataEC50: >5.57E+4nM. Assay description: Source (MLPCN Center Name): The Scripps Research Institute Molecular Screening Center (SRIMSC) Center Affiliation: The Scripps Research Institute (TS...
In DepthDetails PCBioAssay
TargetEukaryotic translation initiation factor 2-alpha kinase 3(Homo sapiens (Human))
The Scripps Research Institute Molecular Screening Center
Curated by PubChem BioAssay
LigandPNGBDBM46467(2-methyl-N-[1-methyl-2-[2-(4-methyl-1-piperazinyl)...)
Affinity DataEC50: >5.57E+4nM. Assay description: Source (MLPCN Center Name): The Scripps Research Institute Molecular Screening Center (SRIMSC) Center Affiliation: The Scripps Research Institute (TS...
In DepthDetails PCBioAssay