BDBM464703 US10793563, Compound I-25
SMILES CS(=O)(=O)NCC1CCN(C1)c1ccnc(n1)-c1cnc2cc(F)c(Br)cn12
InChI Key InChIKey=LEETWZZCMSNJHO-UHFFFAOYSA-N
Data  1 KI
  Tab Delimited (TSV)   2D SDfile   Computed 3D by Vconf -m prep SDfile
Find this compound or compounds like it in BindingDB:
Activity Spreadsheet -- Enzyme Inhibition Constant Data from BindingDB
Found 1 hit for monomerid = 464703
TargeteIF-2-alpha kinase GCN2(Homo sapiens (Human))
Merck Patent
US Patent
LigandPNGBDBM464703(US10793563, Compound I-25)
Affinity DataKi: <10nM. Assay description: An assay buffer containing GCN2 kinase and (RS)7 was prepared. 4.7 μL of this stock solution was placed per well of a black, low volume, 384-wel...
Ligand InfoPC cidPC sid
In DepthDetails US Patent