BDBM464766 US10793563, Compound I-103
SMILES C[C@H]1CN(C[C@@H](CNS(C)(=O)=O)C1(F)F)c1nc(ns1)-c1cnc2ccc(cn12)C(F)F
InChI Key InChIKey=YPMDEBBLRFSAPL-CMPLNLGQSA-N
Data  1 KI
  Tab Delimited (TSV)   2D SDfile   Computed 3D by Vconf -m prep SDfile
Find this compound or compounds like it in BindingDB:
Activity Spreadsheet -- Enzyme Inhibition Constant Data from BindingDB
Found 1 hit for monomerid = 464766
TargeteIF-2-alpha kinase GCN2(Homo sapiens (Human))
Merck Patent
US Patent
LigandPNGBDBM464766(US10793563, Compound I-103)
Affinity DataKi: <10nM. Assay description: An assay buffer containing GCN2 kinase and (RS)7 was prepared. 4.7 μL of this stock solution was placed per well of a black, low volume, 384-wel...
Ligand InfoPC cidPC sid
In DepthDetails US Patent