BDBM46484 2-methyl-3-(2-phenylbutanoylamino)benzoic acid::2-methyl-3-[(1-oxo-2-phenylbutyl)amino]benzoic acid::2-methyl-3-[(2-phenylbutanoyl)amino]benzoic acid::MLS000676286::SMR000300574::cid_2966060
SMILES CCC(C(=O)Nc1cccc(C(O)=O)c1C)c1ccccc1
InChI Key InChIKey=BNRCHWPFXNDZQS-UHFFFAOYSA-N
Data  2 EC50
  Tab Delimited (TSV)   2D SDfile   Computed 3D by Vconf -m prep SDfile
Find this compound or compounds like it in BindingDB:
Activity Spreadsheet -- Enzyme Inhibition Constant Data from BindingDB
Found 2 hits for monomerid = 46484
TargetEukaryotic translation initiation factor 2-alpha kinase 3(Homo sapiens (Human))
The Scripps Research Institute Molecular Screening Center
Curated by PubChem BioAssay
LigandPNGBDBM46484(2-methyl-3-(2-phenylbutanoylamino)benzoic acid | 2...)
Affinity DataEC50: >5.57E+4nM. Assay description: Source (MLPCN Center Name): The Scripps Research Institute Molecular Screening Center (SRIMSC) Center Affiliation: The Scripps Research Institute (TS...
In DepthDetails PCBioAssay
TargetEukaryotic translation initiation factor 2-alpha kinase 3(Homo sapiens (Human))
The Scripps Research Institute Molecular Screening Center
Curated by PubChem BioAssay
LigandPNGBDBM46484(2-methyl-3-(2-phenylbutanoylamino)benzoic acid | 2...)
Affinity DataEC50: >5.57E+4nM. Assay description: Source (MLPCN Center Name): The Scripps Research Institute Molecular Screening Center (SRIMSC) Center Affiliation: The Scripps Research Institute (TS...
In DepthDetails PCBioAssay