BDBM46492 4-(4-keto-5,7-dimethyl-3-phenyl-pyrrolo[3,4-d]pyridazin-6-yl)-N-[2-(4-methylpiperazino)ethyl]butyramide::4-(5,7-dimethyl-1-oxo-2-phenyl-1,2-dihydro-6H-pyrrolo[3,4-d]pyridazin-6-yl)-N-[2-(4-methylpiperazin-1-yl)ethyl]butanamide::4-(5,7-dimethyl-4-oxidanylidene-3-phenyl-pyrrolo[3,4-d]pyridazin-6-yl)-N-[2-(4-methylpiperazin-1-yl)ethyl]butanamide::4-(5,7-dimethyl-4-oxo-3-phenyl-6-pyrrolo[3,4-d]pyridazinyl)-N-[2-(4-methyl-1-piperazinyl)ethyl]butanamide::4-(5,7-dimethyl-4-oxo-3-phenylpyrrolo[3,4-d]pyridazin-6-yl)-N-[2-(4-methylpiperazin-1-yl)ethyl]butanamide::MLS000660593::SMR000310112::cid_16193820
SMILES CN1CCN(CCNC(=O)CCCn2c(C)c3cnn(-c4ccccc4)c(=O)c3c2C)CC1
InChI Key InChIKey=VMDOUAQBNLDUDU-UHFFFAOYSA-N
Data  2 EC50
  Tab Delimited (TSV)   2D SDfile   Computed 3D by Vconf -m prep SDfile
Find this compound or compounds like it in BindingDB:
Activity Spreadsheet -- Enzyme Inhibition Constant Data from BindingDB
Found 2 hits for monomerid = 46492
TargetEukaryotic translation initiation factor 2-alpha kinase 3(Homo sapiens (Human))
The Scripps Research Institute Molecular Screening Center
Curated by PubChem BioAssay
LigandPNGBDBM46492(4-(4-keto-5,7-dimethyl-3-phenyl-pyrrolo[3,4-d]pyri...)
Affinity DataEC50: >5.57E+4nM. Assay description: Source (MLPCN Center Name): The Scripps Research Institute Molecular Screening Center (SRIMSC) Center Affiliation: The Scripps Research Institute (TS...
In DepthDetails PCBioAssay
TargetEukaryotic translation initiation factor 2-alpha kinase 3(Homo sapiens (Human))
The Scripps Research Institute Molecular Screening Center
Curated by PubChem BioAssay
LigandPNGBDBM46492(4-(4-keto-5,7-dimethyl-3-phenyl-pyrrolo[3,4-d]pyri...)
Affinity DataEC50: >5.57E+4nM. Assay description: Source (MLPCN Center Name): The Scripps Research Institute Molecular Screening Center (SRIMSC) Center Affiliation: The Scripps Research Institute (TS...
In DepthDetails PCBioAssay