BDBM465220 US10793564, Compound 9::US11419869, Compound 9::US11560376, Compound 9::US20230271960, Compound 9::US20230293519, Compound 9
SMILES OC(=O)[C@H](CCN(CCCCc1ccc2CCCNc2n1)C1CC(F)(F)C1)Nc1ncnc2ccccc12
InChI Key InChIKey=IEIQVKZZQPWGHH-DEOSSOPVSA-N
Data  5 IC50
  Tab Delimited (TSV)   2D SDfile   Computed 3D by Vconf -m prep SDfile
Find this compound or compounds like it in BindingDB:
Activity Spreadsheet -- Enzyme Inhibition Constant Data from BindingDB
Found 5 hits for monomerid = 465220
Targetalphavbeta6 inhibitionrange(Homo sapiens (Human))
Pliant Therapeutics
US Patent
LigandPNGBDBM465220(US10793564, Compound 9 | US11419869, Compound 9 | ...)
Affinity DataIC50: >1.00E+3nM. Assay description: Microplates were coated with recombinant human integrin αVβ6 (2 μg/mL) in PBS (100 μL/well 25° C., overnight). The coating soluti...
Ligand InfoPC cidPC sid
In DepthDetails US Patent
TargetIntegrin alpha-5/beta-6(Homo sapiens (Human))
Pliant Therapeutics
US Patent
LigandPNGBDBM465220(US10793564, Compound 9 | US11419869, Compound 9 | ...)
Affinity DataIC50: >1.00E+3nM. Assay description: Microplates were coated with recombinant human integrin αVβ6 (2 μg/mL) in PBS (100 μL/well 25° C., overnight). The coating soluti...
Ligand InfoPC cidPC sid
In DepthDetails US Patent
Targetalphavbeta6 inhibitionrange(Homo sapiens (Human))
Pliant Therapeutics
US Patent
LigandPNGBDBM465220(US10793564, Compound 9 | US11419869, Compound 9 | ...)
Affinity DataIC50: >1.00E+3nM. Assay description: Microplates were coated with recombinant human integrin alphavbeta6 (2 ug/mL) in PBS (100 uL/well 25 C., overnight). The coating solution was removed...
Ligand InfoPC cidPC sid
In DepthDetails US Patent
Targetalphavbeta6 inhibitionrange(Homo sapiens (Human))
Pliant Therapeutics
US Patent
LigandPNGBDBM465220(US10793564, Compound 9 | US11419869, Compound 9 | ...)
Affinity DataIC50: >1.00E+3nM. Assay description: Microplates were coated with recombinant human integrin αvβ6 (2 μg/mL) in PBS (100 μL/well 25° C., overnight). The coating soluti...
Ligand InfoPC cidPC sid
In DepthDetails US Patent
Targetalphavbeta6 inhibitionrange(Homo sapiens (Human))
Pliant Therapeutics
US Patent
LigandPNGBDBM465220(US10793564, Compound 9 | US11419869, Compound 9 | ...)
Affinity DataIC50: >1.00E+3nM. Assay description: Microplates were coated with recombinant human integrin αvβ6 (2 μg/mL) in PBS (100 μL/well 25° C., overnight). The coating soluti...
Ligand InfoPC cidPC sid
In DepthDetails US Patent