BDBM465228 US10793564, Compound 17::US11419869, Compound 17::US11560376, Compound 17::US20230271960, Compound 17
SMILES COCCN(CCCCc1ccc2CCCNc2n1)CC[C@H](Nc1ncnc2cnccc12)C(O)=O
InChI Key InChIKey=YDAPEUXGKKAJBC-QFIPXVFZSA-N
Data  4 IC50
  Tab Delimited (TSV)   2D SDfile   Computed 3D by Vconf -m prep SDfile
Find this compound or compounds like it in BindingDB:
Activity Spreadsheet -- Enzyme Inhibition Constant Data from BindingDB
Found 4 hits for monomerid = 465228
Targetalphavbeta6 inhibitionrange(Homo sapiens (Human))
Pliant Therapeutics
US Patent
LigandPNGBDBM465228(US10793564, Compound 17 | US11419869, Compound 17 ...)
Affinity DataIC50: <50nM. Assay description: Microplates were coated with recombinant human integrin αVβ6 (2 μg/mL) in PBS (100 μL/well 25° C., overnight). The coating soluti...
Ligand InfoPC cidPC sid
In DepthDetails US Patent
Targetalphavbeta6 inhibitionrange(Homo sapiens (Human))
Pliant Therapeutics
US Patent
LigandPNGBDBM465228(US10793564, Compound 17 | US11419869, Compound 17 ...)
Affinity DataIC50: <50nM. Assay description: Microplates were coated with recombinant human integrin αvβ6 (2 μg/mL) in PBS (100 μL/well 25° C., overnight). The coating soluti...
Ligand InfoPC cidPC sid
In DepthDetails US Patent
Targetalphavbeta6 inhibitionrange(Homo sapiens (Human))
Pliant Therapeutics
US Patent
LigandPNGBDBM465228(US10793564, Compound 17 | US11419869, Compound 17 ...)
Affinity DataIC50: <50nM. Assay description: Microplates were coated with recombinant human integrin αvβ6 (2 μg/mL) in PBS (100 μL/well 25° C., overnight). The coating soluti...
Ligand InfoPC cidPC sid
In DepthDetails US Patent
TargetIntegrin alpha-5/beta-6(Homo sapiens (Human))
Pliant Therapeutics
US Patent
LigandPNGBDBM465228(US10793564, Compound 17 | US11419869, Compound 17 ...)
Affinity DataIC50: <50nM. Assay description: Microplates were coated with recombinant human integrin αVβ6 (2 μg/mL) in PBS (100 μL/well 25° C., overnight). The coating soluti...
Ligand InfoPC cidPC sid
In DepthDetails US Patent