BDBM465247 US10793564, Compound 36::US11419869, Compound 36::US20230271960, Compound 36::US20230293519, Compound 36
SMILES COCCN(CCCCc1ccc2CCCNc2n1)CC[C@H](Nc1ccnc2ccccc12)C(O)=O
InChI Key InChIKey=JEWMTYWBYMTNPA-SANMLTNESA-N
Data  4 IC50
  Tab Delimited (TSV)   2D SDfile   Computed 3D by Vconf -m prep SDfile
Find this compound or compounds like it in BindingDB:
Activity Spreadsheet -- Enzyme Inhibition Constant Data from BindingDB
Found 4 hits for monomerid = 465247
Targetalphavbeta6 inhibitionrange(Homo sapiens (Human))
Pliant Therapeutics
US Patent
LigandPNGBDBM465247(US10793564, Compound 36 | US11419869, Compound 36 ...)
Affinity DataIC50: >1.00E+3nM. Assay description: Microplates were coated with recombinant human integrin αVβ6 (2 μg/mL) in PBS (100 μL/well 25° C., overnight). The coating soluti...
Ligand InfoPC cidPC sid
In DepthDetails US Patent
Targetalphavbeta6 inhibitionrange(Homo sapiens (Human))
Pliant Therapeutics
US Patent
LigandPNGBDBM465247(US10793564, Compound 36 | US11419869, Compound 36 ...)
Affinity DataIC50: >1.00E+3nM. Assay description: Microplates were coated with recombinant human integrin alphavbeta6 (2 ug/mL) in PBS (100 uL/well 25 C., overnight). The coating solution was removed...
Ligand InfoPC cidPC sid
In DepthDetails US Patent
Targetalphavbeta6 inhibitionrange(Homo sapiens (Human))
Pliant Therapeutics
US Patent
LigandPNGBDBM465247(US10793564, Compound 36 | US11419869, Compound 36 ...)
Affinity DataIC50: >1.00E+3nM. Assay description: Microplates were coated with recombinant human integrin αvβ6 (2 μg/mL) in PBS (100 μL/well 25° C., overnight). The coating soluti...
Ligand InfoPC cidPC sid
In DepthDetails US Patent
TargetIntegrin alpha-5/beta-6(Homo sapiens (Human))
Pliant Therapeutics
US Patent
LigandPNGBDBM465247(US10793564, Compound 36 | US11419869, Compound 36 ...)
Affinity DataIC50: >1.00E+3nM. Assay description: Microplates were coated with recombinant human integrin αVβ6 (2 μg/mL) in PBS (100 μL/well 25° C., overnight). The coating soluti...
Ligand InfoPC cidPC sid
In DepthDetails US Patent