BDBM465255 US10793564, Compound 44::US11419869, Compound 44::US11560376, Compound 44::US20230271960, Compound 44::US20230293519, Compound 44
SMILES COCCN(CCCCc1ccc2CCCNc2n1)CC[C@H](Nc1cc(ncn1)-n1cccn1)C(O)=O
InChI Key InChIKey=MKSZPWOPXXEADG-QFIPXVFZSA-N
Data  6 IC50
  Tab Delimited (TSV)   2D SDfile   Computed 3D by Vconf -m prep SDfile
Find this compound or compounds like it in BindingDB:
Activity Spreadsheet -- Enzyme Inhibition Constant Data from BindingDB
Found 6 hits for monomerid = 465255
Targetalphavbeta6 inhibitionrange(Homo sapiens (Human))
Pliant Therapeutics
US Patent
LigandPNGBDBM465255(US10793564, Compound 44 | US11419869, Compound 44 ...)
Affinity DataIC50: <50nM. Assay description: Microplates were coated with recombinant human integrin αVβ6 (2 μg/mL) in PBS (100 μL/well 25° C., overnight). The coating soluti...
Ligand InfoPC cidPC sid
In DepthDetails US Patent
TargetIntegrin alpha-5/beta-6(Homo sapiens (Human))
Pliant Therapeutics
US Patent
LigandPNGBDBM465255(US10793564, Compound 44 | US11419869, Compound 44 ...)
Affinity DataIC50: <50nM. Assay description: Microplates were coated with recombinant human integrin αVβ6 (2 μg/mL) in PBS (100 μL/well 25° C., overnight). The coating soluti...
Ligand InfoPC cidPC sid
In DepthDetails US Patent
Targetalphavbeta6 inhibitionrange(Homo sapiens (Human))
Pliant Therapeutics
US Patent
LigandPNGBDBM465255(US10793564, Compound 44 | US11419869, Compound 44 ...)
Affinity DataIC50: <50nM. Assay description: Inhibition of recombinant human alphavbeta6 integrin incubated for 2 hrs by microplate reader assay
Ligand InfoPC cidPC sid
In DepthDetails PubMed
Targetalphavbeta6 inhibitionrange(Homo sapiens (Human))
Pliant Therapeutics
US Patent
LigandPNGBDBM465255(US10793564, Compound 44 | US11419869, Compound 44 ...)
Affinity DataIC50: <50nM. Assay description: Microplates were coated with recombinant human integrin αvβ6 (2 μg/mL) in PBS (100 μL/well 25° C., overnight). The coating soluti...
Ligand InfoPC cidPC sid
In DepthDetails US Patent
Targetalphavbeta6 inhibitionrange(Homo sapiens (Human))
Pliant Therapeutics
US Patent
LigandPNGBDBM465255(US10793564, Compound 44 | US11419869, Compound 44 ...)
Affinity DataIC50: <50nM. Assay description: Microplates were coated with recombinant human integrin alphavbeta6 (2 ug/mL) in PBS (100 uL/well 25 C., overnight). The coating solution was removed...
Ligand InfoPC cidPC sid
In DepthDetails US Patent
Targetalphavbeta6 inhibitionrange(Homo sapiens (Human))
Pliant Therapeutics
US Patent
LigandPNGBDBM465255(US10793564, Compound 44 | US11419869, Compound 44 ...)
Affinity DataIC50: <50nM. Assay description: Microplates were coated with recombinant human integrin αvβ6 (2 μg/mL) in PBS (100 μL/well 25° C., overnight). The coating soluti...
Ligand InfoPC cidPC sid
In DepthDetails US Patent