BDBM465298 US10793564, Compound 87::US11419869, Compound 87::US11560376, Compound 87::US20230271960, Compound 87
SMILES COC[C@@H](F)CN(CCCCc1ccc2CCCNc2n1)CC[C@H](Nc1ccnc(n1)C(F)(F)F)C(O)=O
InChI Key InChIKey=DRNAKEUEIWVLBV-ICSRJNTNSA-N
Data  4 IC50
  Tab Delimited (TSV)   2D SDfile   Computed 3D by Vconf -m prep SDfile
Find this compound or compounds like it in BindingDB:
Activity Spreadsheet -- Enzyme Inhibition Constant Data from BindingDB
Found 4 hits for monomerid = 465298
Targetalphavbeta6 inhibitionrange(Homo sapiens (Human))
Pliant Therapeutics
US Patent
LigandPNGBDBM465298(US10793564, Compound 87 | US11419869, Compound 87 ...)
Affinity DataIC50:  625nM. Assay description: Microplates were coated with recombinant human integrin αVβ6 (2 μg/mL) in PBS (100 μL/well 25° C., overnight). The coating soluti...
Ligand InfoPC cidPC sid
In DepthDetails US Patent
Targetalphavbeta6 inhibitionrange(Homo sapiens (Human))
Pliant Therapeutics
US Patent
LigandPNGBDBM465298(US10793564, Compound 87 | US11419869, Compound 87 ...)
Affinity DataIC50:  625nM. Assay description: Microplates were coated with recombinant human integrin αvβ6 (2 μg/mL) in PBS (100 μL/well 25° C., overnight). The coating soluti...
Ligand InfoPC cidPC sid
In DepthDetails US Patent
Targetalphavbeta6 inhibitionrange(Homo sapiens (Human))
Pliant Therapeutics
US Patent
LigandPNGBDBM465298(US10793564, Compound 87 | US11419869, Compound 87 ...)
Affinity DataIC50:  625nM. Assay description: A third series of exemplary compounds was selected for testing in the solid phase integrin αvβ6 binding assay. The compounds tested were co...
Ligand InfoPC cidPC sid
In DepthDetails US Patent
TargetIntegrin alpha-5/beta-6(Homo sapiens (Human))
Pliant Therapeutics
US Patent
LigandPNGBDBM465298(US10793564, Compound 87 | US11419869, Compound 87 ...)
Affinity DataIC50:  625nM. Assay description: Microplates were coated with recombinant human integrin αVβ6 (2 μg/mL) in PBS (100 μL/well 25° C., overnight). The coating soluti...
Ligand InfoPC cidPC sid
In DepthDetails US Patent