BDBM465312 US10793564, Compound 101::US11419869, Compound 101::US11560376, Compound 101::US20230271960, Compound 101::US20230293519, Compound 101
SMILES Cn1ncc2c(N[C@@H](CCN(CCCCc3ccc4CCCNc4n3)CCS(C)(=O)=O)C(O)=O)ncnc12
InChI Key InChIKey=UYMOSJMAWDJBMJ-NRFANRHFSA-N
Data  5 IC50
  Tab Delimited (TSV)   2D SDfile   Computed 3D by Vconf -m prep SDfile
Find this compound or compounds like it in BindingDB:
Activity Spreadsheet -- Enzyme Inhibition Constant Data from BindingDB
Found 5 hits for monomerid = 465312
Targetalphavbeta6 inhibitionrange(Homo sapiens (Human))
Pliant Therapeutics
US Patent
LigandPNGBDBM465312(US10793564, Compound 101 | US11419869, Compound 10...)
Affinity DataIC50:  150nM. Assay description: Microplates were coated with recombinant human integrin αVβ6 (2 μg/mL) in PBS (100 μL/well 25° C., overnight). The coating soluti...
Ligand InfoPC cidPC sid
In DepthDetails US Patent
TargetIntegrin alpha-5/beta-6(Homo sapiens (Human))
Pliant Therapeutics
US Patent
LigandPNGBDBM465312(US10793564, Compound 101 | US11419869, Compound 10...)
Affinity DataIC50:  150nM. Assay description: Microplates were coated with recombinant human integrin αVβ6 (2 μg/mL) in PBS (100 μL/well 25° C., overnight). The coating soluti...
Ligand InfoPC cidPC sid
In DepthDetails US Patent
Targetalphavbeta6 inhibitionrange(Homo sapiens (Human))
Pliant Therapeutics
US Patent
LigandPNGBDBM465312(US10793564, Compound 101 | US11419869, Compound 10...)
Affinity DataIC50:  150nM. Assay description: Microplates were coated with recombinant human integrin alphavbeta6 (2 ug/mL) in PBS (100 uL/well 25 C., overnight). The coating solution was removed...
Ligand InfoPC cidPC sid
In DepthDetails US Patent
Targetalphavbeta6 inhibitionrange(Homo sapiens (Human))
Pliant Therapeutics
US Patent
LigandPNGBDBM465312(US10793564, Compound 101 | US11419869, Compound 10...)
Affinity DataIC50:  150nM. Assay description: Microplates were coated with recombinant human integrin αvβ6 (2 μg/mL) in PBS (100 μL/well 25° C., overnight). The coating soluti...
Ligand InfoPC cidPC sid
In DepthDetails US Patent
Targetalphavbeta6 inhibitionrange(Homo sapiens (Human))
Pliant Therapeutics
US Patent
LigandPNGBDBM465312(US10793564, Compound 101 | US11419869, Compound 10...)
Affinity DataIC50:  150nM. Assay description: A third series of exemplary compounds was selected for testing in the solid phase integrin αvβ6 binding assay. The compounds tested were co...
Ligand InfoPC cidPC sid
In DepthDetails US Patent