BDBM465336 US10793564, Compound 126::US11419869, Compound 126::US11560376, Compound 126::US20230271960, Compound 126::US20230293519, Compound 126
SMILES CS(=O)(=O)CCN(CCCCc1ccc2CCCNc2n1)CC[C@H](Nc1cc(ncn1)-n1cccn1)C(O)=O
InChI Key InChIKey=CBABINZKYHSJHZ-QFIPXVFZSA-N
Data  5 IC50
  Tab Delimited (TSV)   2D SDfile   Computed 3D by Vconf -m prep SDfile
Find this compound or compounds like it in BindingDB:
Activity Spreadsheet -- Enzyme Inhibition Constant Data from BindingDB
Found 5 hits for monomerid = 465336
Targetalphavbeta6 inhibitionrange(Homo sapiens (Human))
Pliant Therapeutics
US Patent
LigandPNGBDBM465336(US10793564, Compound 126 | US11419869, Compound 12...)
Affinity DataIC50: >1.00E+3nM. Assay description: Microplates were coated with recombinant human integrin αVβ6 (2 μg/mL) in PBS (100 μL/well 25° C., overnight). The coating soluti...
Ligand InfoPC cidPC sid
In DepthDetails US Patent
TargetIntegrin alpha-5/beta-6(Homo sapiens (Human))
Pliant Therapeutics
US Patent
LigandPNGBDBM465336(US10793564, Compound 126 | US11419869, Compound 12...)
Affinity DataIC50: >1.00E+3nM. Assay description: Microplates were coated with recombinant human integrin αVβ6 (2 μg/mL) in PBS (100 μL/well 25° C., overnight). The coating soluti...
Ligand InfoPC cidPC sid
In DepthDetails US Patent
Targetalphavbeta6 inhibitionrange(Homo sapiens (Human))
Pliant Therapeutics
US Patent
LigandPNGBDBM465336(US10793564, Compound 126 | US11419869, Compound 12...)
Affinity DataIC50: >1.00E+3nM. Assay description: Microplates were coated with recombinant human integrin alphavbeta6 (2 ug/mL) in PBS (100 uL/well 25 C., overnight). The coating solution was removed...
Ligand InfoPC cidPC sid
In DepthDetails US Patent
Targetalphavbeta6 inhibitionrange(Homo sapiens (Human))
Pliant Therapeutics
US Patent
LigandPNGBDBM465336(US10793564, Compound 126 | US11419869, Compound 12...)
Affinity DataIC50: >1.00E+3nM. Assay description: Microplates were coated with recombinant human integrin αvβ6 (2 μg/mL) in PBS (100 μL/well 25° C., overnight). The coating soluti...
Ligand InfoPC cidPC sid
In DepthDetails US Patent
Targetalphavbeta6 inhibitionrange(Homo sapiens (Human))
Pliant Therapeutics
US Patent
LigandPNGBDBM465336(US10793564, Compound 126 | US11419869, Compound 12...)
Affinity DataIC50: >1.00E+3nM. Assay description: Microplates were coated with recombinant human integrin αvβ6 (2 μg/mL) in PBS (100 μL/well 25° C., overnight). The coating soluti...
Ligand InfoPC cidPC sid
In DepthDetails US Patent