BDBM46534 2-methyl-N'-[5-(trifluoromethyl)-2-pyridinyl]propanehydrazide::2-methyl-N'-[5-(trifluoromethyl)-2-pyridyl]propionohydrazide::2-methyl-N'-[5-(trifluoromethyl)pyridin-2-yl]propanehydrazide::MLS000861387::N'1-[5-(trifluoromethyl)-2-pyridyl]-2-methylpropanohydrazide::SMR000460171::cid_2727167
SMILES CC(C)C(=O)NNc1ccc(cn1)C(F)(F)F
InChI Key InChIKey=ZNPDRRPVZGSDBD-UHFFFAOYSA-N
Data  2 EC50
  Tab Delimited (TSV)   2D SDfile   Computed 3D by Vconf -m prep SDfile
Find this compound or compounds like it in BindingDB:
Activity Spreadsheet -- Enzyme Inhibition Constant Data from BindingDB
Found 2 hits for monomerid = 46534
TargetEukaryotic translation initiation factor 2-alpha kinase 3(Homo sapiens (Human))
The Scripps Research Institute Molecular Screening Center
Curated by PubChem BioAssay
LigandPNGBDBM46534(2-methyl-N'-[5-(trifluoromethyl)-2-pyridinyl]propa...)
Affinity DataEC50: >5.57E+4nM. Assay description: Source (MLPCN Center Name): The Scripps Research Institute Molecular Screening Center (SRIMSC) Center Affiliation: The Scripps Research Institute (TS...
In DepthDetails PCBioAssay
TargetEukaryotic translation initiation factor 2-alpha kinase 3(Homo sapiens (Human))
The Scripps Research Institute Molecular Screening Center
Curated by PubChem BioAssay
LigandPNGBDBM46534(2-methyl-N'-[5-(trifluoromethyl)-2-pyridinyl]propa...)
Affinity DataEC50: >5.57E+4nM. Assay description: Source (MLPCN Center Name): The Scripps Research Institute Molecular Screening Center (SRIMSC) Center Affiliation: The Scripps Research Institute (TS...
In DepthDetails PCBioAssay