BDBM465347 US10793564, Compound 137::US11419869, Compound 137::US11560376, Compound 137::US20230271960, Compound 137::US20230293519, Compound 137
SMILES OC(=O)[C@H](CCN(CCCF)CCCCc1ccc2CCCNc2n1)Nc1ncc(cn1)C(F)(F)F
InChI Key InChIKey=YPNSPVVIDFWJJM-FQEVSTJZSA-N
Data  5 IC50
  Tab Delimited (TSV)   2D SDfile   Computed 3D by Vconf -m prep SDfile
Find this compound or compounds like it in BindingDB:
Activity Spreadsheet -- Enzyme Inhibition Constant Data from BindingDB
Found 5 hits for monomerid = 465347
Targetalphavbeta6 inhibitionrange(Homo sapiens (Human))
Pliant Therapeutics
US Patent
LigandPNGBDBM465347(US10793564, Compound 137 | US11419869, Compound 13...)
Affinity DataIC50: <50nM. Assay description: Microplates were coated with recombinant human integrin αVβ6 (2 μg/mL) in PBS (100 μL/well 25° C., overnight). The coating soluti...
Ligand InfoPC cidPC sid
In DepthDetails US Patent
TargetIntegrin alpha-5/beta-6(Homo sapiens (Human))
Pliant Therapeutics
US Patent
LigandPNGBDBM465347(US10793564, Compound 137 | US11419869, Compound 13...)
Affinity DataIC50: <50nM. Assay description: Microplates were coated with recombinant human integrin αVβ6 (2 μg/mL) in PBS (100 μL/well 25° C., overnight). The coating soluti...
Ligand InfoPC cidPC sid
In DepthDetails US Patent
Targetalphavbeta6 inhibitionrange(Homo sapiens (Human))
Pliant Therapeutics
US Patent
LigandPNGBDBM465347(US10793564, Compound 137 | US11419869, Compound 13...)
Affinity DataIC50: <50nM. Assay description: Microplates were coated with recombinant human integrin alphavbeta6 (2 ug/mL) in PBS (100 uL/well 25 C., overnight). The coating solution was removed...
Ligand InfoPC cidPC sid
In DepthDetails US Patent
Targetalphavbeta6 inhibitionrange(Homo sapiens (Human))
Pliant Therapeutics
US Patent
LigandPNGBDBM465347(US10793564, Compound 137 | US11419869, Compound 13...)
Affinity DataIC50: <50nM. Assay description: Microplates were coated with recombinant human integrin αvβ6 (2 μg/mL) in PBS (100 μL/well 25° C., overnight). The coating soluti...
Ligand InfoPC cidPC sid
In DepthDetails US Patent
Targetalphavbeta6 inhibitionrange(Homo sapiens (Human))
Pliant Therapeutics
US Patent
LigandPNGBDBM465347(US10793564, Compound 137 | US11419869, Compound 13...)
Affinity DataIC50: <50nM. Assay description: A third series of exemplary compounds was selected for testing in the solid phase integrin αvβ6 binding assay. The compounds tested were co...
Ligand InfoPC cidPC sid
In DepthDetails US Patent